emake failed

classic Classic list List threaded Threaded
5 messages Options
Reply | Threaded
Open this post in threaded view
|

emake failed

Sebastian
Hallo,

mittlerweile verweigern schon 2 Programme ihren bau. Leider bekomme ich aus
den Fehlermeldungen nicht raus was mir weiterhilft. Der gcc wird erstmal ca 1h
gebaut bevor die Fehlermeldung erscheint.

 * ERROR: dev-python/PyQt5-5.5.1::gentoo failed (compile phase):
 *   emake failed
 *
 * If you need support, post the output of `emerge --info '=dev-
python/PyQt5-5.5.1::gentoo'`,
 * the complete build log and the output of `emerge -pqv '=dev-
python/PyQt5-5.5.1::gentoo'`.
 * The complete build log is located at '/var/tmp/portage/dev-
python/PyQt5-5.5.1/temp/build.log'.
 * The ebuild environment file is located at '/var/tmp/portage/dev-
python/PyQt5-5.5.1/temp/environment'.
 * Working directory: '/var/tmp/portage/dev-python/PyQt5-5.5.1/work/PyQt-
gpl-5.5.1-python3_4'
 * S: '/var/tmp/portage/dev-python/PyQt5-5.5.1/work/PyQt-gpl-5.5.1'

und ebenso der gcc:

Pyton:
l1-gentoo sebastian # emerge --info =dev-python/PyQt5-5.5.1
Portage 2.3.0 (python 3.4.5-final-0, default/linux/amd64/13.0/desktop/plasma,
gcc-4.9.3, glibc-2.22-r4, 4.4.6-gentoo-2-default x86_64)
=================================================================
                         System Settings
=================================================================
System uname: Linux-4.4.6-gentoo-2-default-x86_64-
AMD_A8-3500M_APU_with_Radeon-tm-_HD_Graphics-with-gentoo-2.3
KiB Mem:     7628824 total,   1529048 free
KiB Swap:   10482684 total,   9798508 free
Timestamp of repository gentoo: Tue, 20 Dec 2016 16:30:01 +0000
sh bash 4.3_p48-r1
ld GNU ld (Gentoo 2.25.1 p1.1) 2.25.1
app-shells/bash:          4.3_p48-r1::gentoo
dev-lang/perl:            5.22.3_rc4::gentoo
dev-lang/python:          2.7.12::gentoo, 3.4.5::gentoo
dev-util/cmake:           3.5.2-r1::gentoo
dev-util/pkgconfig:       0.28-r2::gentoo
sys-apps/baselayout:      2.3::gentoo
sys-apps/openrc:          0.22.4::gentoo
sys-apps/sandbox:         2.10-r1::gentoo
sys-devel/autoconf:       2.13::gentoo, 2.69::gentoo
sys-devel/automake:       1.11.6-r1::gentoo, 1.14.1::gentoo, 1.15::gentoo
sys-devel/binutils:       2.25.1-r1::gentoo
sys-devel/gcc:            4.9.3::gentoo
sys-devel/gcc-config:     1.7.3::gentoo
sys-devel/libtool:        2.4.6-r2::gentoo
sys-devel/make:           4.1-r1::gentoo
sys-kernel/linux-headers: 4.4::gentoo (virtual/os-headers)
sys-libs/glibc:           2.22-r4::gentoo
Repositories:

gentoo
    location: /usr/portage
    sync-type: rsync
    sync-uri: rsync://rsync.gentoo.org/gentoo-portage
    priority: -1000

ACCEPT_KEYWORDS="amd64"
ACCEPT_LICENSE="* -@EULA"
CBUILD="x86_64-pc-linux-gnu"
CFLAGS="-mtune=amdfam10 -O2 -pipe"
CHOST="x86_64-pc-linux-gnu"
CONFIG_PROTECT="/etc /usr/share/config /usr/share/gnupg/qualified.txt"
CONFIG_PROTECT_MASK="/etc/ca-certificates.conf /etc/dconf /etc/env.d
/etc/fonts/fonts.conf /etc/gconf /etc/gentoo-release /etc/php/apache2-
php5.6/ext-active/ /etc/php/cgi-php5.6/ext-active/ /etc/php/cli-php5.6/ext-
active/ /etc/revdep-rebuild /etc/sandbox.d /etc/terminfo"
CXXFLAGS="-mtune=amdfam10 -O2 -pipe"
DISTDIR="/usr/portage/distfiles"
FCFLAGS="-O2 -pipe"
FEATURES="assume-digests binpkg-logs config-protect-if-modified distlocks
ebuild-locks fixlafiles merge-sync news parallel-fetch preserve-libs protect-
owned sandbox sfperms strict unknown-features-warn unmerge-logs unmerge-
orphans userfetch userpriv usersandbox usersync xattr"
FFLAGS="-O2 -pipe"
GENTOO_MIRRORS="http://ftp.halifax.rwth-aachen.de/gentoo/ 
http://distfiles.gentoo.org 
http://www.ibiblio.org/pub/Linux/distributions/gentoo"
LANG="de_DE.UTF-8"
LDFLAGS="-Wl,-O1 -Wl,--as-needed"
MAKEOPTS="-j5"
PKGDIR="/usr/portage/packages"
PORTAGE_CONFIGROOT="/"
PORTAGE_RSYNC_OPTS="--recursive --links --safe-links --perms --times --omit-
dir-times --compress --force --whole-file --delete --stats --human-readable --
timeout=180 --exclude=/distfiles --exclude=/local --exclude=/packages --
exclude=/.git"
PORTAGE_TMPDIR="/var/tmp"
USE="X a52 aac acl acpi alsa amd64 apache2 berkdb bluetooth branding bzip2
cairo cdda cddb cdr cli consolekit cracklib crypt css cups cxx dbus
declarative dri dts dvd dvdr emboss encode exif fam firefox flac fortran gdbm
gif glamor gpm hbci iconv ipv6 jpeg kde kipi kontact lcms ldap libnotify mad
minizip mmx mmxext mng modules mp3 mp4 mpeg mtp multilib ncurses
networkmanager nls nptl ogg opengl openmp pam pango pcre pdf phonon php plasma
png policykit ppds pulseaudio qml qt3support qt4 qt5 readline samba sdl
seccomp semantic-desktop session spell sse sse2 ssl startup-notification svg
tcpd tiff truetype udev udisks unicode upower usb vorbis widgets wmf wxwidgets
x264 xattr xcb xcomposite xinerama xml xscreensaver xv xvid zlib" ABI_X86="64"
ALSA_CARDS="ali5451 als4000 atiixp atiixp-modem bt87x ca0106 cmipci emu10k1x
ens1370 ens1371 es1938 es1968 fm801 hda-intel intel8x0 intel8x0m maestro3
trident usb-audio via82xx via82xx-modem ymfpci" APACHE2_MODULES="authn_core
authz_core socache_shmcb unixd actions alias auth_basic authn_alias authn_anon
authn_dbm authn_default authn_file authz_dbm authz_default authz_groupfile
authz_host authz_owner authz_user autoindex cache cgi cgid dav dav_fs dav_lock
deflate dir disk_cache env expires ext_filter file_cache filter headers include
info log_config logio mem_cache mime mime_magic negotiation rewrite setenvif
speling status unique_id userdir usertrack vhost_alias"
CALLIGRA_FEATURES="kexi words flow plan sheets stage tables krita karbon
braindump author" CAMERAS="ptp2" COLLECTD_PLUGINS="df interface irq load
memory rrdtool swap syslog" CPU_FLAGS_X86="3dnow 3dnowext mmx mmxext popcnt
sse sse2 sse3 sse4a" ELIBC="glibc" GPSD_PROTOCOLS="ashtech aivdm earthmate
evermore fv18 garmin garmintxt gpsclock itrax mtk3301 nmea ntrip navcom
oceanserver oldstyle oncore rtcm104v2 rtcm104v3 sirf superstar2 timing tsip
tripmate tnt ublox ubx" INPUT_DEVICES="evdev synaptics" KERNEL="linux"
L10N="de" LCD_DEVICES="bayrad cfontz cfontz633 glk hd44780 lb216 lcdm001
mtxorb ncurses text" LIBREOFFICE_EXTENSIONS="presenter-console presenter-
minimizer" LINGUAS="de en" OFFICE_IMPLEMENTATION="libreoffice"
PHP_TARGETS="php5-6" PYTHON_SINGLE_TARGET="python2_7"
PYTHON_TARGETS="python2_7 python3_4" RUBY_TARGETS="ruby21" USERLAND="GNU"
VIDEO_CARDS="radeon" XTABLES_ADDONS="quota2 psd pknock lscan length2
ipv4options ipset ipp2p iface geoip fuzzy condition tee tarpit sysrq steal
rawnat logmark ipmark dhcpmac delude chaos account"
Unset:  CC, CPPFLAGS, CTARGET, CXX, EMERGE_DEFAULT_OPTS, INSTALL_MASK, LC_ALL,
PORTAGE_BUNZIP2_COMMAND, PORTAGE_COMPRESS, PORTAGE_COMPRESS_FLAGS,
PORTAGE_RSYNC_EXTRA_OPTS, USE_PYTHON

=================================================================
                        Package Settings
=================================================================

dev-python/PyQt5-5.5.1::gentoo was built with the following:
USE="dbus declarative gui network opengl printsupport svg widgets -debug -
designer -doc -examples -gles2 -help -multimedia -positioning -sensors -
serialport -sql -testlib -webchannel -webkit -websockets -x11extras -
xmlpatterns" ABI_X86="64" PYTHON_TARGETS="python2_7 python3_4 -python3_5"

--- das ende der Ausgabe auf der Konsole zu PyQt

rm -f libpyqt5.so
x86_64-pc-linux-gnu-g++ -Wl,-O1 -Wl,--as-needed -Wl,--version-script=pyqt5.exp
-shared -o libpyqt5.so dbus.o moc_helper.o  -ldbus-1 -lQt5Core -lpthread  
cp -f libpyqt5.so pyqt5.so
make[1]: Leaving directory '/var/tmp/portage/dev-python/PyQt5-5.5.1/work/PyQt-
gpl-5.5.1-python2_7/dbus'
 * python3_4: running run_in_build_dir default
make -j5
cd QtCore/ && ( test -e Makefile || /usr/lib64/qt5/bin/qmake
/var/tmp/portage/dev-python/PyQt5-5.5.1/work/PyQt-gpl-5.5.1-
python3_4/QtCore/QtCore.pro 'QMAKE_AR=x86_64-pc-linux-gnu-ar cqs'
QMAKE_CC=x86_64-pc-linux-gnu-gcc QMAKE_LINK_C=x86_64-pc-linux-gnu-gcc
QMAKE_LINK_C_SHLIB=x86_64-pc-linux-gnu-gcc QMAKE_CXX=x86_64-pc-linux-gnu-g++
QMAKE_LINK=x86_64-pc-linux-gnu-g++ QMAKE_LINK_SHLIB=x86_64-pc-linux-gnu-g++
QMAKE_OBJCOPY=x86_64-pc-linux-gnu-objcopy QMAKE_RANLIB= QMAKE_STRIP=
'QMAKE_CFLAGS=-mtune=amdfam10 -O2 -pipe' QMAKE_CFLAGS_RELEASE=
QMAKE_CFLAGS_DEBUG= 'QMAKE_CXXFLAGS=-mtune=amdfam10 -O2 -pipe'
QMAKE_CXXFLAGS_RELEASE= QMAKE_CXXFLAGS_DEBUG= 'QMAKE_LFLAGS=-Wl,-O1 -Wl,--as-
needed' QMAKE_LFLAGS_RELEASE= QMAKE_LFLAGS_DEBUG= -o Makefile ) && make -f
Makefile
make[1]: Entering directory '/var/tmp/portage/dev-
python/PyQt5-5.5.1/work/PyQt-gpl-5.5.1-python3_4/QtCore'
x86_64-pc-linux-gnu-g++ -c -mtune=amdfam10 -O2 -pipe -fno-exceptions -
std=gnu++0x -Wall -W -D_REENTRANT -fPIC -DSIP_PROTECTED_IS_PUBLIC -
Dprotected=public -DQT_NO_DEBUG -DQT_PLUGIN -DQT_CORE_LIB -I. -I. -isystem
/usr/include/python3.4m -I../../PyQt-gpl-5.5.1/qpy/QtCore -isystem
/usr/include/qt5 -isystem /usr/include/qt5/QtCore -I. -
I/usr/lib64/qt5/mkspecs/linux-g++ -o qpycore_post_init.o qpycore_post_init.cpp
x86_64-pc-linux-gnu-g++ -c -mtune=amdfam10 -O2 -pipe -fno-exceptions -
std=gnu++0x -Wall -W -D_REENTRANT -fPIC -DSIP_PROTECTED_IS_PUBLIC -
Dprotected=public -DQT_NO_DEBUG -DQT_PLUGIN -DQT_CORE_LIB -I. -I. -isystem
/usr/include/python3.4m -I../../PyQt-gpl-5.5.1/qpy/QtCore -isystem
/usr/include/qt5 -isystem /usr/include/qt5/QtCore -I. -
I/usr/lib64/qt5/mkspecs/linux-g++ -o sipQtCoreqintptr.o sipQtCoreqintptr.cpp
x86_64-pc-linux-gnu-g++ -c -mtune=amdfam10 -O2 -pipe -fno-exceptions -
std=gnu++0x -Wall -W -D_REENTRANT -fPIC -DSIP_PROTECTED_IS_PUBLIC -
Dprotected=public -DQT_NO_DEBUG -DQT_PLUGIN -DQT_CORE_LIB -I. -I. -isystem
/usr/include/python3.4m -I../../PyQt-gpl-5.5.1/qpy/QtCore -isystem
/usr/include/qt5 -isystem /usr/include/qt5/QtCore -I. -
I/usr/lib64/qt5/mkspecs/linux-g++ -o sipQtCorequintptr.o sipQtCorequintptr.cpp
x86_64-pc-linux-gnu-g++ -c -mtune=amdfam10 -O2 -pipe -fno-exceptions -
std=gnu++0x -Wall -W -D_REENTRANT -fPIC -DSIP_PROTECTED_IS_PUBLIC -
Dprotected=public -DQT_NO_DEBUG -DQT_PLUGIN -DQT_CORE_LIB -I. -I. -isystem
/usr/include/python3.4m -I../../PyQt-gpl-5.5.1/qpy/QtCore -isystem
/usr/include/qt5 -isystem /usr/include/qt5/QtCore -I. -
I/usr/lib64/qt5/mkspecs/linux-g++ -o sipQtCoreQt.o sipQtCoreQt.cpp
x86_64-pc-linux-gnu-g++ -c -mtune=amdfam10 -O2 -pipe -fno-exceptions -
std=gnu++0x -Wall -W -D_REENTRANT -fPIC -DSIP_PROTECTED_IS_PUBLIC -
Dprotected=public -DQT_NO_DEBUG -DQT_PLUGIN -DQT_CORE_LIB -I. -I. -isystem
/usr/include/python3.4m -I../../PyQt-gpl-5.5.1/qpy/QtCore -isystem
/usr/include/qt5 -isystem /usr/include/qt5/QtCore -I. -
I/usr/lib64/qt5/mkspecs/linux-g++ -o sipQtCoreQtKeyboardModifiers.o
sipQtCoreQtKeyboardModifiers.cpp
In file included from sipQtCoreQt.cpp:24:0:
sipAPIQtCore.h:28:17: fatal error: sip.h: No such file or directory
 #include <sip.h>
                 ^
compilation terminated.
In file included from sipQtCorequintptr.cpp:24:0:
sipAPIQtCore.h:28:17: fatal error: sip.h: No such file or directory
 #include <sip.h>
                 ^
compilation terminated.
In file included from sipQtCoreQtKeyboardModifiers.cpp:24:0:
sipAPIQtCore.h:28:17: fatal error: sip.h: No such file or directory
 #include <sip.h>
                 ^
compilation terminated.
In file included from sipQtCoreqintptr.cpp:24:0:
sipAPIQtCore.h:28:17: fatal error: sip.h: No such file or directory
 #include <sip.h>
                 ^
Makefile:1423: recipe for target 'sipQtCorequintptr.o' failed
make[1]: *** [sipQtCorequintptr.o] Error 1
compilation terminated.
make[1]: *** Waiting for unfinished jobs....
Makefile:1429: recipe for target 'sipQtCoreQt.o' failed
make[1]: *** [sipQtCoreQt.o] Error 1
Makefile:1435: recipe for target 'sipQtCoreQtKeyboardModifiers.o' failed
make[1]: *** [sipQtCoreQtKeyboardModifiers.o] Error 1
Makefile:1417: recipe for target 'sipQtCoreqintptr.o' failed
make[1]: *** [sipQtCoreqintptr.o] Error 1
In file included from ../../PyQt-gpl-5.5.1/qpy/QtCore/qpycore_api.h:30:0,
                 from qpycore_post_init.cpp:25:
../../PyQt-gpl-5.5.1/qpy/QtCore/qpycore_public_api.h:26:17: fatal error:
sip.h: No such file or directory
 #include <sip.h>
                 ^
compilation terminated.
Makefile:1411: recipe for target 'qpycore_post_init.o' failed
make[1]: *** [qpycore_post_init.o] Error 1
make[1]: Leaving directory '/var/tmp/portage/dev-python/PyQt5-5.5.1/work/PyQt-
gpl-5.5.1-python3_4/QtCore'
Makefile:61: recipe for target 'sub-QtCore-make_first-ordered' failed
make: *** [sub-QtCore-make_first-ordered] Error 2
 * ERROR: dev-python/PyQt5-5.5.1::gentoo failed (compile phase):
 *   emake failed
 *
 * If you need support, post the output of `emerge --info '=dev-
python/PyQt5-5.5.1::gentoo'`,
 * the complete build log and the output of `emerge -pqv '=dev-
python/PyQt5-5.5.1::gentoo'`.
 * The complete build log is located at '/var/tmp/portage/dev-
python/PyQt5-5.5.1/temp/build.log'.
 * The ebuild environment file is located at '/var/tmp/portage/dev-
python/PyQt5-5.5.1/temp/environment'.
 * Working directory: '/var/tmp/portage/dev-python/PyQt5-5.5.1/work/PyQt-
gpl-5.5.1-python3_4'
 * S: '/var/tmp/portage/dev-python/PyQt5-5.5.1/work/PyQt-gpl-5.5.1'


--- und hier noch das Ende der gcc Ausgabe:


libtool: link: (cd ".libs" && rm -f "libgfortran.so.3" && ln -s
"libgfortran.so.3.0.0" "libgfortran.so.3")
libtool: link: (cd ".libs" && rm -f "libgfortran.so" && ln -s
"libgfortran.so.3.0.0" "libgfortran.so")
libtool: link: /usr/x86_64-pc-linux-gnu/bin/ar rc .libs/libgfortran.a  
backtrace.o bounds.o compile_options.o convert_char.o environ.o error.o fpu.o
main.o memory.o pause.o stop.o string.o select.o all_l1.o all_l2.o all_l4.o
all_l8.o all_l16.o any_l1.o any_l2.o any_l4.o any_l8.o any_l16.o count_1_l.o
count_2_l.o count_4_l.o count_8_l.o count_16_l.o maxloc0_4_i1.o maxloc0_8_i1.o
maxloc0_16_i1.o maxloc0_4_i2.o maxloc0_8_i2.o maxloc0_16_i2.o maxloc0_4_i4.o
maxloc0_8_i4.o maxloc0_16_i4.o maxloc0_4_i8.o maxloc0_8_i8.o maxloc0_16_i8.o
maxloc0_4_i16.o maxloc0_8_i16.o maxloc0_16_i16.o maxloc0_4_r4.o maxloc0_8_r4.o
maxloc0_16_r4.o maxloc0_4_r8.o maxloc0_8_r8.o maxloc0_16_r8.o maxloc0_4_r10.o
maxloc0_8_r10.o maxloc0_16_r10.o maxloc0_4_r16.o maxloc0_8_r16.o
maxloc0_16_r16.o maxloc1_4_i1.o maxloc1_8_i1.o maxloc1_16_i1.o maxloc1_4_i2.o
maxloc1_8_i2.o maxloc1_16_i2.o maxloc1_4_i4.o maxloc1_8_i4.o maxloc1_16_i4.o
maxloc1_4_i8.o maxloc1_8_i8.o maxloc1_16_i8.o maxloc1_4_i16.o maxloc1_8_i16.o
maxloc1_16_i16.o maxloc1_4_r4.o maxloc1_8_r4.o maxloc1_16_r4.o maxloc1_4_r8.o
maxloc1_8_r8.o maxloc1_16_r8.o maxloc1_4_r10.o maxloc1_8_r10.o
maxloc1_16_r10.o maxloc1_4_r16.o maxloc1_8_r16.o maxloc1_16_r16.o maxval_i1.o
maxval_i2.o maxval_i4.o maxval_i8.o maxval_i16.o maxval_r4.o maxval_r8.o
maxval_r10.o maxval_r16.o minloc0_4_i1.o minloc0_8_i1.o minloc0_16_i1.o
minloc0_4_i2.o minloc0_8_i2.o minloc0_16_i2.o minloc0_4_i4.o minloc0_8_i4.o
minloc0_16_i4.o minloc0_4_i8.o minloc0_8_i8.o minloc0_16_i8.o minloc0_4_i16.o
minloc0_8_i16.o minloc0_16_i16.o minloc0_4_r4.o minloc0_8_r4.o minloc0_16_r4.o
minloc0_4_r8.o minloc0_8_r8.o minloc0_16_r8.o minloc0_4_r10.o minloc0_8_r10.o
minloc0_16_r10.o minloc0_4_r16.o minloc0_8_r16.o minloc0_16_r16.o
minloc1_4_i1.o minloc1_8_i1.o minloc1_16_i1.o minloc1_4_i2.o minloc1_8_i2.o
minloc1_16_i2.o minloc1_4_i4.o minloc1_8_i4.o minloc1_16_i4.o minloc1_4_i8.o
minloc1_8_i8.o minloc1_16_i8.o minloc1_4_i16.o minloc1_8_i16.o
minloc1_16_i16.o minloc1_4_r4.o minloc1_8_r4.o minloc1_16_r4.o minloc1_4_r8.o
minloc1_8_r8.o minloc1_16_r8.o minloc1_4_r10.o minloc1_8_r10.o
minloc1_16_r10.o minloc1_4_r16.o minloc1_8_r16.o minloc1_16_r16.o minval_i1.o
minval_i2.o minval_i4.o minval_i8.o minval_i16.o minval_r4.o minval_r8.o
minval_r10.o minval_r16.o product_i1.o product_i2.o product_i4.o product_i8.o
product_i16.o product_r4.o product_r8.o product_r10.o product_r16.o
product_c4.o product_c8.o product_c10.o product_c16.o sum_i1.o sum_i2.o
sum_i4.o sum_i8.o sum_i16.o sum_r4.o sum_r8.o sum_r10.o sum_r16.o sum_c4.o
sum_c8.o sum_c10.o sum_c16.o bessel_r4.o bessel_r8.o bessel_r10.o bessel_r16.o
iall_i1.o iall_i2.o iall_i4.o iall_i8.o iall_i16.o iany_i1.o iany_i2.o
iany_i4.o iany_i8.o iany_i16.o iparity_i1.o iparity_i2.o iparity_i4.o
iparity_i8.o iparity_i16.o norm2_r4.o norm2_r8.o norm2_r10.o norm2_r16.o
parity_l1.o parity_l2.o parity_l4.o parity_l8.o parity_l16.o matmul_i1.o
matmul_i2.o matmul_i4.o matmul_i8.o matmul_i16.o matmul_r4.o matmul_r8.o
matmul_r10.o matmul_r16.o matmul_c4.o matmul_c8.o matmul_c10.o matmul_c16.o
matmul_l4.o matmul_l8.o matmul_l16.o transpose_i4.o transpose_i8.o
transpose_i16.o transpose_r4.o transpose_r8.o transpose_r10.o transpose_r16.o
transpose_c4.o transpose_c8.o transpose_c10.o transpose_c16.o shape_i4.o
shape_i8.o shape_i16.o eoshift1_4.o eoshift1_8.o eoshift1_16.o eoshift3_4.o
eoshift3_8.o eoshift3_16.o cshift1_4.o cshift1_8.o cshift1_16.o reshape_i4.o
reshape_i8.o reshape_i16.o reshape_r4.o reshape_r8.o reshape_r10.o
reshape_r16.o reshape_c4.o reshape_c8.o reshape_c10.o reshape_c16.o
in_pack_i1.o in_pack_i2.o in_pack_i4.o in_pack_i8.o in_pack_i16.o in_pack_r4.o
in_pack_r8.o in_pack_r10.o in_pack_r16.o in_pack_c4.o in_pack_c8.o
in_pack_c10.o in_pack_c16.o in_unpack_i1.o in_unpack_i2.o in_unpack_i4.o
in_unpack_i8.o in_unpack_i16.o in_unpack_r4.o in_unpack_r8.o in_unpack_r10.o
in_unpack_r16.o in_unpack_c4.o in_unpack_c8.o in_unpack_c10.o in_unpack_c16.o
exponent_r4.o exponent_r8.o exponent_r10.o exponent_r16.o fraction_r4.o
fraction_r8.o fraction_r10.o fraction_r16.o nearest_r4.o nearest_r8.o
nearest_r10.o nearest_r16.o set_exponent_r4.o set_exponent_r8.o
set_exponent_r10.o set_exponent_r16.o pow_i4_i4.o pow_i8_i4.o pow_i16_i4.o
pow_r16_i4.o pow_c4_i4.o pow_c8_i4.o pow_c10_i4.o pow_c16_i4.o pow_i4_i8.o
pow_i8_i8.o pow_i16_i8.o pow_r4_i8.o pow_r8_i8.o pow_r10_i8.o pow_r16_i8.o
pow_c4_i8.o pow_c8_i8.o pow_c10_i8.o pow_c16_i8.o pow_i4_i16.o pow_i8_i16.o
pow_i16_i16.o pow_r4_i16.o pow_r8_i16.o pow_r10_i16.o pow_r16_i16.o
pow_c4_i16.o pow_c8_i16.o pow_c10_i16.o pow_c16_i16.o rrspacing_r4.o
rrspacing_r8.o rrspacing_r10.o rrspacing_r16.o spacing_r4.o spacing_r8.o
spacing_r10.o spacing_r16.o pack_i1.o pack_i2.o pack_i4.o pack_i8.o pack_i16.o
pack_r4.o pack_r8.o pack_r10.o pack_r16.o pack_c4.o pack_c8.o pack_c10.o
pack_c16.o unpack_i1.o unpack_i2.o unpack_i4.o unpack_i8.o unpack_i16.o
unpack_r4.o unpack_r8.o unpack_r10.o unpack_r16.o unpack_c4.o unpack_c8.o
unpack_c10.o unpack_c16.o spread_i1.o spread_i2.o spread_i4.o spread_i8.o
spread_i16.o spread_r4.o spread_r8.o spread_r10.o spread_r16.o spread_c4.o
spread_c8.o spread_c10.o spread_c16.o cshift0_i1.o cshift0_i2.o cshift0_i4.o
cshift0_i8.o cshift0_i16.o cshift0_r4.o cshift0_r8.o cshift0_r10.o
cshift0_r16.o cshift0_c4.o cshift0_c8.o cshift0_c10.o cshift0_c16.o close.o
file_pos.o format.o inquire.o intrinsics.o list_read.o lock.o open.o read.o
size_from_kind.o transfer.o transfer128.o unit.o unix.o write.o fbuf.o
associated.o abort.o access.o args.o bit_intrinsics.o c99_functions.o chdir.o
chmod.o clock.o cpu_time.o cshift0.o ctime.o date_and_time.o dtime.o env.o
eoshift0.o eoshift2.o erfc_scaled.o etime.o execute_command_line.o exit.o
extends_type_of.o fnum.o gerror.o getcwd.o getlog.o getXid.o hostnm.o ierrno.o
ishftc.o iso_c_generated_procs.o iso_c_binding.o kill.o link.o malloc.o
mvbits.o move_alloc.o pack_generic.o perror.o selected_char_kind.o signal.o
size.o sleep.o spread_generic.o string_intrinsics.o system.o rand.o random.o
rename.o reshape_generic.o reshape_packed.o selected_int_kind.o
selected_real_kind.o stat.o symlnk.o system_clock.o time.o transpose_generic.o
umask.o unlink.o unpack_generic.o in_pack_generic.o in_unpack_generic.o
_abs_c4.o _abs_c8.o _abs_c10.o _abs_c16.o _abs_i4.o _abs_i8.o _abs_i16.o
_abs_r4.o _abs_r8.o _abs_r10.o _abs_r16.o _aimag_c4.o _aimag_c8.o _aimag_c10.o
_aimag_c16.o _exp_r4.o _exp_r8.o _exp_r10.o _exp_r16.o _exp_c4.o _exp_c8.o
_exp_c10.o _exp_c16.o _log_r4.o _log_r8.o _log_r10.o _log_r16.o _log_c4.o
_log_c8.o _log_c10.o _log_c16.o _log10_r4.o _log10_r8.o _log10_r10.o
_log10_r16.o _sqrt_r4.o _sqrt_r8.o _sqrt_r10.o _sqrt_r16.o _sqrt_c4.o
_sqrt_c8.o _sqrt_c10.o _sqrt_c16.o _asin_r4.o _asin_r8.o _asin_r10.o
_asin_r16.o _asinh_r4.o _asinh_r8.o _asinh_r10.o _asinh_r16.o _acos_r4.o
_acos_r8.o _acos_r10.o _acos_r16.o _acosh_r4.o _acosh_r8.o _acosh_r10.o
_acosh_r16.o _atan_r4.o _atan_r8.o _atan_r10.o _atan_r16.o _atanh_r4.o
_atanh_r8.o _atanh_r10.o _atanh_r16.o _sin_r4.o _sin_r8.o _sin_r10.o
_sin_r16.o _sin_c4.o _sin_c8.o _sin_c10.o _sin_c16.o _cos_r4.o _cos_r8.o
_cos_r10.o _cos_r16.o _cos_c4.o _cos_c8.o _cos_c10.o _cos_c16.o _tan_r4.o
_tan_r8.o _tan_r10.o _tan_r16.o _sinh_r4.o _sinh_r8.o _sinh_r10.o _sinh_r16.o
_cosh_r4.o _cosh_r8.o _cosh_r10.o _cosh_r16.o _tanh_r4.o _tanh_r8.o
_tanh_r10.o _tanh_r16.o _conjg_c4.o _conjg_c8.o _conjg_c10.o _conjg_c16.o
_aint_r4.o _aint_r8.o _aint_r10.o _aint_r16.o _anint_r4.o _anint_r8.o
_anint_r10.o _anint_r16.o _sign_i4.o _sign_i8.o _sign_i16.o _sign_r4.o
_sign_r8.o _sign_r10.o _sign_r16.o _dim_i4.o _dim_i8.o _dim_i16.o _dim_r4.o
_dim_r8.o _dim_r10.o _dim_r16.o _atan2_r4.o _atan2_r8.o _atan2_r10.o
_atan2_r16.o _mod_i4.o _mod_i8.o _mod_i16.o _mod_r4.o _mod_r8.o _mod_r10.o
_mod_r16.o misc_specifics.o dprod_r8.o f2c_specifics.o
libtool: link: /usr/x86_64-pc-linux-gnu/bin/ranlib .libs/libgfortran.a
libtool: link: ( cd ".libs" && rm -f "libgfortran.la" && ln -s
"../libgfortran.la" "libgfortran.la" )
make[6]: Leaving directory '/var/tmp/portage/sys-
devel/gcc-4.9.4/work/build/x86_64-pc-linux-gnu/32/libgfortran'
make[5]: Leaving directory '/var/tmp/portage/sys-
devel/gcc-4.9.4/work/build/x86_64-pc-linux-gnu/32/libgfortran'
make[4]: Leaving directory '/var/tmp/portage/sys-
devel/gcc-4.9.4/work/build/x86_64-pc-linux-gnu/libgfortran'
make[3]: Leaving directory '/var/tmp/portage/sys-
devel/gcc-4.9.4/work/build/x86_64-pc-linux-gnu/libgfortran'
make[2]: Leaving directory '/var/tmp/portage/sys-
devel/gcc-4.9.4/work/build/x86_64-pc-linux-gnu/libgfortran'
make[1]: Leaving directory '/var/tmp/portage/sys-devel/gcc-4.9.4/work/build'
Makefile:20667: recipe for target 'bootstrap-lean' failed
make: *** [bootstrap-lean] Error 2
 * ERROR: sys-devel/gcc-4.9.4::gentoo failed (compile phase):
 *   emake failed
 *
 * If you need support, post the output of `emerge --info '=sys-
devel/gcc-4.9.4::gentoo'`,
 * the complete build log and the output of `emerge -pqv '=sys-
devel/gcc-4.9.4::gentoo'`.
 * The complete build log is located at '/var/tmp/portage/sys-
devel/gcc-4.9.4/temp/build.log'.
 * The ebuild environment file is located at '/var/tmp/portage/sys-
devel/gcc-4.9.4/temp/environment'.
 * Working directory: '/var/tmp/portage/sys-devel/gcc-4.9.4/work/build'
 * S: '/var/tmp/portage/sys-devel/gcc-4.9.4/work/gcc-4.9.4'
 *
 * Please include /var/tmp/portage/sys-devel/gcc-4.9.4/work/gcc-build-
logs.tar.bz2 in your bug report.
 *

>>> Failed to emerge sys-devel/gcc-4.9.4, Log file:


Gruß
Sebastian











Reply | Threaded
Open this post in threaded view
|

Re: emake failed

David Haller-5
Hallo,

Am Tue, 20 Dec 2016, Sebastian schrieb:
>mittlerweile verweigern schon 2 Programme ihren bau. Leider bekomme ich aus
>den Fehlermeldungen nicht raus was mir weiterhilft. Der gcc wird erstmal ca 1h
>gebaut bevor die Fehlermeldung erscheint.
[..]
=================================================================
                        Package Settings
=================================================================

>dev-python/PyQt5-5.5.1::gentoo was built with the following:
>USE="dbus declarative gui network opengl printsupport svg widgets -debug -
>designer -doc -examples -gles2 -help -multimedia -positioning -sensors -
>serialport -sql -testlib -webchannel -webkit -websockets -x11extras -
>xmlpatterns" ABI_X86="64" PYTHON_TARGETS="python2_7 python3_4 -python3_5"
[..]                                       ^^^^^^^^^^^^^^^^^^^^^^^^^^^^^^
> * ERROR: dev-python/PyQt5-5.5.1::gentoo failed (compile phase):
> *   emake failed
[..]
>x86_64-pc-linux-gnu-g++ -c -mtune=amdfam10 -O2 -pipe -fno-exceptions -
>std=gnu++0x -Wall -W -D_REENTRANT -fPIC -DSIP_PROTECTED_IS_PUBLIC -
>Dprotected=public -DQT_NO_DEBUG -DQT_PLUGIN -DQT_CORE_LIB -I. -I. -isystem
>/usr/include/python3.4m -I../../PyQt-gpl-5.5.1/qpy/QtCore -isystem
 ^^^^^^^^^^^^^^^^^^^^^^
>/usr/include/qt5 -isystem /usr/include/qt5/QtCore -I. -
>I/usr/lib64/qt5/mkspecs/linux-g++ -o sipQtCoreQtKeyboardModifiers.o
>sipQtCoreQtKeyboardModifiers.cpp
>In file included from sipQtCoreQt.cpp:24:0:
>sipAPIQtCore.h:28:17: fatal error: sip.h: No such file or directory
> #include <sip.h>
>                 ^
>compilation terminated.

Ist 'dev-python/sip' für Python 3.4 installiert?

# equery files dev-python/sip | grep 'sip\.h'
# equery uses -i dev-python/sip | grep target
# equery uses -i dev-python/PyQt5 | grep target

Die Ausgabe der letztern beiden müssen übereinstimmen. Aha, schon
geschnibbelt gehabt: du hast

PYTHON_SINGLE_TARGET="python2_7"
PYTHON_TARGETS="python2_7 python3_4"

in make.conf, baust also für 2.7 und 3.4, dazu passt auch obige
Ausgabe, aber scheinbar hast du dev-python/sip nicht für python3.4
gebaut. Durchsuch mal dein /etc/portage/ (z.B. mit mc) nach useflags
für dev-python/sip...


>libtool: link: (cd ".libs" && rm -f "libgfortran.so.3" && ln -s
>"libgfortran.so.3.0.0" "libgfortran.so.3")
>libtool: link: (cd ".libs" && rm -f "libgfortran.so" && ln -s
>"libgfortran.so.3.0.0" "libgfortran.so")
>libtool: link: /usr/x86_64-pc-linux-gnu/bin/ar rc .libs/libgfortran.a  
[..]
>_mod_r16.o misc_specifics.o dprod_r8.o f2c_specifics.o
>libtool: link: /usr/x86_64-pc-linux-gnu/bin/ranlib .libs/libgfortran.a
>libtool: link: ( cd ".libs" && rm -f "libgfortran.la" && ln -s
>"../libgfortran.la" "libgfortran.la" )
[..]
>make[1]: Leaving directory '/var/tmp/portage/sys-devel/gcc-4.9.4/work/build'
>Makefile:20667: recipe for target 'bootstrap-lean' failed
>make: *** [bootstrap-lean] Error 2

Das ist alles ohne Fehler, der Fehler war irgendwo vorher, bau
mal mit '-j1' statt -j5, dann kann man die logs besser lesen, weil
nicht 5 makes durcheinander schreiben.

HTH,
-dnh

--
printk(KERN_ERR "BIGMAC: Would you like that for here or to go?\n");
        linux-2.6.19/drivers/net/sunbmac.c

Reply | Threaded
Open this post in threaded view
|

Re: emake failed

Sebastian
Hallo,

danke für den hinweis nach dem Neubauen von pyhton/sip hat sich das Problem
Phyton erledigt.

Ein Useflag habe ich nicht gefunden.

>
> Am Tue, 20 Dec 2016, Sebastian schrieb:
> >mittlerweile verweigern schon 2 Programme ihren bau. Leider bekomme ich aus
> >den Fehlermeldungen nicht raus was mir weiterhilft. Der gcc wird erstmal ca
> >1h gebaut bevor die Fehlermeldung erscheint.
>
> [..]
> =================================================================
>                         Package Settings
> =================================================================


>
> Das ist alles ohne Fehler, der Fehler war irgendwo vorher, bau
> mal mit '-j1' statt -j5, dann kann man die logs besser lesen, weil
> nicht 5 makes durcheinander schreiben.


Hier das Ende der Ausgabe beim bauen von gcc mit -j1. Ich hoffe jetzt kann
jemand helfen damit.

Gruß
Sebastian

mv -f .deps/gnu_javax_sound_midi_dssi_DSSISynthesizer.Tpo
.deps/gnu_javax_sound_midi_dssi_DSSISynthesizer.Plo
/bin/bash ../../../libtool --tag=CC   --mode=link /var/tmp/portage/sys-
devel/gcc-4.9.4/work/build/./gcc/xgcc -B/var/tmp/portage/sys-
devel/gcc-4.9.4/work/build/./gcc/ -B/usr/x86_64-pc-linux-gnu/bin/ -
B/usr/x86_64-pc-linux-gnu/lib/ -isystem /usr/x86_64-pc-linux-gnu/include -
isystem /usr/x86_64-pc-linux-gnu/sys-include  -m32 -W -Wall -Wmissing-
declarations -Wwrite-strings -Wmissing-prototypes -Wno-long-long  -fexceptions
-fasynchronous-unwind-tables -g -mtune=amdfam10 -O2 -pipe  -m32 -module -
version-info 0:0:0 -no-undefined -avoid-version -m32 -o libgjsmdssi.la -rpath
/usr/lib/../lib32/gcj-4.9.4-15
gnu_javax_sound_midi_dssi_DSSIMidiDeviceProvider.lo
gnu_javax_sound_midi_dssi_DSSISynthesizer.lo
../../../native/jni/classpath/jcl.lo -ljack
libtool: link: /var/tmp/portage/sys-devel/gcc-4.9.4/work/build/./gcc/xgcc -
B/var/tmp/portage/sys-devel/gcc-4.9.4/work/build/./gcc/ -B/usr/x86_64-pc-
linux-gnu/bin/ -B/usr/x86_64-pc-linux-gnu/lib/ -isystem /usr/x86_64-pc-linux-
gnu/include -isystem /usr/x86_64-pc-linux-gnu/sys-include  -m32 -shared  
.libs/gnu_javax_sound_midi_dssi_DSSIMidiDeviceProvider.o
.libs/gnu_javax_sound_midi_dssi_DSSISynthesizer.o
../../../native/jni/classpath/.libs/jcl.o   -ljack  -m32 -mtune=amdfam10 -m32
-m32   -Wl,-soname -Wl,libgjsmdssi.so -o .libs/libgjsmdssi.so
/usr/x86_64-pc-linux-gnu/bin/ld: skipping incompatible /usr/lib/libjack.so
when searching for -ljack
/usr/x86_64-pc-linux-gnu/bin/ld: cannot find -ljack
collect2: error: ld returned 1 exit status
Makefile:411: recipe for target 'libgjsmdssi.la' failed
make[8]: *** [libgjsmdssi.la] Error 1
make[8]: Leaving directory '/var/tmp/portage/sys-
devel/gcc-4.9.4/work/build/x86_64-pc-linux-
gnu/32/libjava/classpath/native/jni/midi-dssi'
Makefile:361: recipe for target 'all-recursive' failed
make[7]: *** [all-recursive] Error 1
make[7]: Leaving directory '/var/tmp/portage/sys-
devel/gcc-4.9.4/work/build/x86_64-pc-linux-
gnu/32/libjava/classpath/native/jni'
Makefile:349: recipe for target 'all-recursive' failed
make[6]: *** [all-recursive] Error 1
make[6]: Leaving directory '/var/tmp/portage/sys-
devel/gcc-4.9.4/work/build/x86_64-pc-linux-gnu/32/libjava/classpath/native'
Makefile:413: recipe for target 'all-recursive' failed
make[5]: *** [all-recursive] Error 1
make[5]: Leaving directory '/var/tmp/portage/sys-
devel/gcc-4.9.4/work/build/x86_64-pc-linux-gnu/32/libjava/classpath'
Makefile:10240: recipe for target 'all-recursive' failed
make[4]: *** [all-recursive] Error 1
make[4]: Leaving directory '/var/tmp/portage/sys-
devel/gcc-4.9.4/work/build/x86_64-pc-linux-gnu/32/libjava'
Makefile:12804: recipe for target 'multi-do' failed
make[3]: *** [multi-do] Error 1
make[3]: Leaving directory '/var/tmp/portage/sys-
devel/gcc-4.9.4/work/build/x86_64-pc-linux-gnu/libjava'
Makefile:12768: recipe for target 'all-multi' failed
make[2]: *** [all-multi] Error 2
make[2]: Leaving directory '/var/tmp/portage/sys-
devel/gcc-4.9.4/work/build/x86_64-pc-linux-gnu/libjava'
Makefile:17040: recipe for target 'all-target-libjava' failed
make[1]: *** [all-target-libjava] Error 2
make[1]: Leaving directory '/var/tmp/portage/sys-devel/gcc-4.9.4/work/build'
Makefile:20667: recipe for target 'bootstrap-lean' failed
make: *** [bootstrap-lean] Error 2
 * ERROR: sys-devel/gcc-4.9.4::gentoo failed (compile phase):
 *   emake failed
 *
 * If you need support, post the output of `emerge --info '=sys-
devel/gcc-4.9.4::gentoo'`,
 * the complete build log and the output of `emerge -pqv '=sys-
devel/gcc-4.9.4::gentoo'`.
 * The complete build log is located at '/var/tmp/portage/sys-
devel/gcc-4.9.4/temp/build.log'.
 * The ebuild environment file is located at '/var/tmp/portage/sys-
devel/gcc-4.9.4/temp/environment'.
 * Working directory: '/var/tmp/portage/sys-devel/gcc-4.9.4/work/build'
 * S: '/var/tmp/portage/sys-devel/gcc-4.9.4/work/gcc-4.9.4'
 *
 * Please include /var/tmp/portage/sys-devel/gcc-4.9.4/work/gcc-build-
logs.tar.bz2 in your bug report.
 *




Reply | Threaded
Open this post in threaded view
|

Re: emake failed

David Haller-5
Hallo,

Am Fri, 30 Dec 2016, Sebastian schrieb:
[..]

>libtool: link: /var/tmp/portage/sys-devel/gcc-4.9.4/work/build/./gcc/xgcc -
>B/var/tmp/portage/sys-devel/gcc-4.9.4/work/build/./gcc/ -B/usr/x86_64-pc-
>linux-gnu/bin/ -B/usr/x86_64-pc-linux-gnu/lib/ -isystem /usr/x86_64-pc-linux-
>gnu/include -isystem /usr/x86_64-pc-linux-gnu/sys-include  -m32 -shared  
>.libs/gnu_javax_sound_midi_dssi_DSSIMidiDeviceProvider.o
>.libs/gnu_javax_sound_midi_dssi_DSSISynthesizer.o
>../../../native/jni/classpath/.libs/jcl.o   -ljack  -m32 -mtune=amdfam10 -m32
>-m32   -Wl,-soname -Wl,libgjsmdssi.so -o .libs/libgjsmdssi.so
>/usr/x86_64-pc-linux-gnu/bin/ld: skipping incompatible /usr/lib/libjack.so
>when searching for -ljack
>/usr/x86_64-pc-linux-gnu/bin/ld: cannot find -ljack

Wenn ich das richtig lese hast du ein (teilweises) multilib setup und
dir fehlt aber die 32bit-Version der libjack. Also pack/ergänze die
Useflags:
media-sound/jack-audio-connection-kit   abi_x86_32
und baue media-sound/jack-audio-connection-kit neu.

HTH,
-dnh

--
panic ("Splunge!");
        linux-2.2.16/drivers/scsi/psi240i.c

Reply | Threaded
Open this post in threaded view
|

gelöst: [gentoo-user-de] emake failed

Sebastian
Hallo,


> Wenn ich das richtig lese hast du ein (teilweises) multilib setup und
> dir fehlt aber die 32bit-Version der libjack. Also pack/ergänze die
> Useflags:
> media-sound/jack-audio-connection-kit   abi_x86_32
> und baue media-sound/jack-audio-connection-kit neu.

Ah das hat mir wahrscheinlich wine eingebrockt. Aber jetzt hat es geklappt.

Vielen Dank
Sebastian